NBS Minimal BASIC Test Programs: Version 2, User's Manual, Volume 13U.S. Department of Commerce, National Bureau of Standards, 1980 |
From inside the book
Page 17
... test results ; but minimization is not elimination . In the best case , the program will print out a conspicuous message indicating that the test passed or failed , and you need only interpret this message correctly . In other cases ...
... test results ; but minimization is not elimination . In the best case , the program will print out a conspicuous message indicating that the test passed or failed , and you need only interpret this message correctly . In other cases ...
Page 23
... test serving three complementary purposes : 1 . 2 . 3 . system , The user's manual ( this document ) . The purpose of ... PASSED *** " or " *** TEST FAILED If the test cannot diagnose its own behavior , it will print a conditional pass ...
... test serving three complementary purposes : 1 . 2 . 3 . system , The user's manual ( this document ) . The purpose of ... PASSED *** " or " *** TEST FAILED If the test cannot diagnose its own behavior , it will print a conditional pass ...
Page 24
... passes or fails independently ; all sections not just the last , must print " *** TEST PASSED *** " for the program as a whole to pass . Figure 2 contains a schematic outline of standard program output . Format of Test Program Output ...
... passes or fails independently ; all sections not just the last , must print " *** TEST PASSED *** " for the program as a whole to pass . Figure 2 contains a schematic outline of standard program output . Format of Test Program Output ...
Page 25
... tests and general remarks about the purpose of this section . BEGIN TEST . function - specific messages and test results *** TEST PASSED ( or FAILED ) ** *** or INFORMATIVE TEST PASSED ( or FAILED ) *** or conditional pass / fail ...
... tests and general remarks about the purpose of this section . BEGIN TEST . function - specific messages and test results *** TEST PASSED ( or FAILED ) ** *** or INFORMATIVE TEST PASSED ( or FAILED ) *** or conditional pass / fail ...
Page 35
... tests , since the behavior of a failing processor is impossible to predict . Passing implementations will cause the 11 * * * TEST PASSED *** " message to appear , but certain kinds of failures might cause the programs to abort , without ...
... tests , since the behavior of a failing processor is impossible to predict . Passing implementations will cause the 11 * * * TEST PASSED *** " message to appear , but certain kinds of failures might cause the programs to abort , without ...
Other editions - View all
Common terms and phrases
20 PRINT 40 PRINT SECTION ACCEPT THE PROGRAM ACCOMPANIED BY DOCUMENTATION ACCURACY ACTUAL ALLOWING ANSI STANDARD ARGUMENT ARRAY ASSIGNED BASIC TEST PROGRAMS CHARACTERS COLUMN COMPUTED CONSTANTS CONTAINING CONTROL DATA DIGITS DISPLAYED END END TEST ENTER ERROR EVALUATION EXACT EXECUTION EXPECTED FOLLOWING FUNCTION GOSUB GOTO IDENTIFYING THE EXCEPTION implementation INFORMATIVE TEST INPUT INPUT-REPLY ITEM LINE LOOP MEASURE MESSAGE IDENTIFYING MINIMAL BASIC TEST NBS MINIMAL BASIC NEGATIVE NON-STANDARD FEATURE NOTE NUMERIC EXPRESSIONS OCCUR OK OK OK operations ORDER OUTPUT OVERFLOW PASS THIS TEST POSITIVE PRINT 40 PRINT PRINT BEGIN TEST PRINT END PROGRAM PRINT END TEST PRINT PROGRAM FILE PRINT THIS SECTION PRINT TO PASS PROCESSOR PROGRAM NUMBER PROGRAM TESTS PROGRAMS USER'S MANUAL READ REFERENCE REFS REJECT THE PROGRAM REPORTED RESULT RETURN RND FUNCTION SECTION TESTS SPACE STATEMENT STEP STRING SUBSCRIPT SUPPLIED TERMINATE TEST FAILED TEST OK TEST PASSED TYPE UNDERFLOW VALUE VARIABLE ZERO